======================================================================
ERROR: test_decomp.test_lapack_misaligned(<function solve at 0x10392db18>, (array([[  1.734e-255,   8.189e-217,   4.025e-178,   1.903e-139,   9.344e-101,
----------------------------------------------------------------------
Traceback (most recent call last):
  File "/Library/Frameworks/Python.framework/Versions/2.6/lib/python2.6/site-packages/nose-0.11.2.dev-py2.6.egg/nose/case.py", line 186, in runTest
    self.test(*self.arg)
  File "/Library/Frameworks/Python.framework/Versions/2.6/lib/python2.6/site-packages/scipy/linalg/tests/test_decomp.py", line 1109, in check_lapack_misaligned
    func(*a,**kwargs)
  File "/Library/Frameworks/Python.framework/Versions/2.6/lib/python2.6/site-packages/scipy/linalg/basic.py", line 127, in solve
    a1, b1 = map(asarray_chkfinite,(a,b))
  File "/Library/Frameworks/Python.framework/Versions/2.6/lib/python2.6/site-packages/numpy/lib/function_base.py", line 516, in asarray_chkfinite
    raise ValueError, "array must not contain infs or NaNs"
ValueError: array must not contain infs or NaNs

======================================================================
ERROR: test_io.test_imread
----------------------------------------------------------------------
Traceback (most recent call last):
  File "/Library/Frameworks/Python.framework/Versions/2.6/lib/python2.6/site-packages/nose-0.11.2.dev-py2.6.egg/nose/case.py", line 186, in runTest
    self.test(*self.arg)
  File "/Library/Frameworks/Python.framework/Versions/2.6/lib/python2.6/site-packages/scipy/ndimage/tests/test_io.py", line 8, in test_imread
    img = ndi.imread(lp)
  File "/Library/Frameworks/Python.framework/Versions/2.6/lib/python2.6/site-packages/scipy/ndimage/io.py", line 26, in imread
    raise ImportError("Could not import the Python Imaging Library (PIL)"
ImportError: Could not import the Python Imaging Library (PIL) required to load image files.  Please refer to http://pypi.python.org/pypi/PIL/ for installation instructions.

======================================================================
ERROR: Ticket #1124.
----------------------------------------------------------------------
Traceback (most recent call last):
  File "/Library/Frameworks/Python.framework/Versions/2.6/lib/python2.6/site-packages/scipy/signal/tests/test_signaltools.py", line 285, in test_none
    signal.medfilt(None)
  File "/Library/Frameworks/Python.framework/Versions/2.6/lib/python2.6/site-packages/scipy/signal/signaltools.py", line 310, in medfilt
    return sigtools._order_filterND(volume,domain,order)
ValueError: order_filterND not available for this type

======================================================================
ERROR: test_complex_nonsymmetric_modes (test_arpack.TestEigenComplexNonSymmetric)
----------------------------------------------------------------------
Traceback (most recent call last):
  File "/Library/Frameworks/Python.framework/Versions/2.6/lib/python2.6/site-packages/scipy/sparse/linalg/eigen/arpack/tests/test_arpack.py", line 267, in test_complex_nonsymmetric_modes
    self.eval_evec(m,typ,k,which)
  File "/Library/Frameworks/Python.framework/Versions/2.6/lib/python2.6/site-packages/scipy/sparse/linalg/eigen/arpack/tests/test_arpack.py", line 248, in eval_evec
    eval,evec=eigen(a,k,which=which)
  File "/Library/Frameworks/Python.framework/Versions/2.6/lib/python2.6/site-packages/scipy/sparse/linalg/eigen/arpack/arpack.py", line 221, in eigen
    raise RuntimeError("Error info=%d in arpack"%info)
RuntimeError: Error info=-8 in arpack

======================================================================
ERROR: test_nonsymmetric_modes (test_arpack.TestEigenNonSymmetric)
----------------------------------------------------------------------
Traceback (most recent call last):
  File "/Library/Frameworks/Python.framework/Versions/2.6/lib/python2.6/site-packages/scipy/sparse/linalg/eigen/arpack/tests/test_arpack.py", line 204, in test_nonsymmetric_modes
    self.eval_evec(m,typ,k,which)
  File "/Library/Frameworks/Python.framework/Versions/2.6/lib/python2.6/site-packages/scipy/sparse/linalg/eigen/arpack/tests/test_arpack.py", line 186, in eval_evec
    eval,evec=eigen(a,k,which=which,**kwds)
  File "/Library/Frameworks/Python.framework/Versions/2.6/lib/python2.6/site-packages/scipy/sparse/linalg/eigen/arpack/arpack.py", line 221, in eigen
    raise RuntimeError("Error info=%d in arpack"%info)
RuntimeError: Error info=-8 in arpack

======================================================================
ERROR: test_starting_vector (test_arpack.TestEigenNonSymmetric)
----------------------------------------------------------------------
Traceback (most recent call last):
  File "/Library/Frameworks/Python.framework/Versions/2.6/lib/python2.6/site-packages/scipy/sparse/linalg/eigen/arpack/tests/test_arpack.py", line 214, in test_starting_vector
    self.eval_evec(self.symmetric[0],typ,k,which='LM',v0=v0)
  File "/Library/Frameworks/Python.framework/Versions/2.6/lib/python2.6/site-packages/scipy/sparse/linalg/eigen/arpack/tests/test_arpack.py", line 186, in eval_evec
    eval,evec=eigen(a,k,which=which,**kwds)
  File "/Library/Frameworks/Python.framework/Versions/2.6/lib/python2.6/site-packages/scipy/sparse/linalg/eigen/arpack/arpack.py", line 221, in eigen
    raise RuntimeError("Error info=%d in arpack"%info)
RuntimeError: Error info=-8 in arpack

======================================================================
ERROR: test_discrete_basic.test_discrete_basic(<scipy.stats.distributions.bernoulli_gen object at 0x104221350>, (0.29999999999999999,), array([0, 0, 0, ..., 1, 0, 0]), 0.01, 'bernoulli chisquare')
----------------------------------------------------------------------
Traceback (most recent call last):
  File "/Library/Frameworks/Python.framework/Versions/2.6/lib/python2.6/site-packages/nose-0.11.2.dev-py2.6.egg/nose/case.py", line 186, in runTest
    self.test(*self.arg)
  File "/Library/Frameworks/Python.framework/Versions/2.6/lib/python2.6/site-packages/scipy/stats/tests/test_discrete_basic.py", line 252, in check_discrete_chisquare
    freq,hsupp = np.histogram(rvs,histsupp,new=True)
TypeError: histogram() got an unexpected keyword argument 'new'

======================================================================
ERROR: test_discrete_basic.test_discrete_basic(<scipy.stats.distributions.binom_gen object at 0x104221150>, (5, 0.40000000000000002), array([2, 2, 2, ..., 4, 1, 3]), 0.01, 'binom chisquare')
----------------------------------------------------------------------
Traceback (most recent call last):
  File "/Library/Frameworks/Python.framework/Versions/2.6/lib/python2.6/site-packages/nose-0.11.2.dev-py2.6.egg/nose/case.py", line 186, in runTest
    self.test(*self.arg)
  File "/Library/Frameworks/Python.framework/Versions/2.6/lib/python2.6/site-packages/scipy/stats/tests/test_discrete_basic.py", line 252, in check_discrete_chisquare
    freq,hsupp = np.histogram(rvs,histsupp,new=True)
TypeError: histogram() got an unexpected keyword argument 'new'

======================================================================
ERROR: test_discrete_basic.test_discrete_basic(<scipy.stats.distributions.boltzmann_gen object at 0x104221dd0>, (1.3999999999999999, 19), array([0, 0, 0, ..., 2, 0, 0]), 0.01, 'boltzmann chisquare')
----------------------------------------------------------------------
Traceback (most recent call last):
  File "/Library/Frameworks/Python.framework/Versions/2.6/lib/python2.6/site-packages/nose-0.11.2.dev-py2.6.egg/nose/case.py", line 186, in runTest
    self.test(*self.arg)
  File "/Library/Frameworks/Python.framework/Versions/2.6/lib/python2.6/site-packages/scipy/stats/tests/test_discrete_basic.py", line 252, in check_discrete_chisquare
    freq,hsupp = np.histogram(rvs,histsupp,new=True)
TypeError: histogram() got an unexpected keyword argument 'new'

======================================================================
ERROR: test_discrete_basic.test_discrete_basic(<scipy.stats.distributions.dlaplace_gen object at 0x1042272d0>, (0.80000000000000004,), array([ 0,  0,  0, ...,  4, -1,  0]), 0.01, 'dlaplace chisquare')
----------------------------------------------------------------------
Traceback (most recent call last):
  File "/Library/Frameworks/Python.framework/Versions/2.6/lib/python2.6/site-packages/nose-0.11.2.dev-py2.6.egg/nose/case.py", line 186, in runTest
    self.test(*self.arg)
  File "/Library/Frameworks/Python.framework/Versions/2.6/lib/python2.6/site-packages/scipy/stats/tests/test_discrete_basic.py", line 252, in check_discrete_chisquare
    freq,hsupp = np.histogram(rvs,histsupp,new=True)
TypeError: histogram() got an unexpected keyword argument 'new'

======================================================================
ERROR: test_discrete_basic.test_discrete_basic(<scipy.stats.distributions.geom_gen object at 0x104221650>, (0.5,), array([1, 1, 2, ..., 6, 1, 2]), 0.01, 'geom chisquare')
----------------------------------------------------------------------
Traceback (most recent call last):
  File "/Library/Frameworks/Python.framework/Versions/2.6/lib/python2.6/site-packages/nose-0.11.2.dev-py2.6.egg/nose/case.py", line 186, in runTest
    self.test(*self.arg)
  File "/Library/Frameworks/Python.framework/Versions/2.6/lib/python2.6/site-packages/scipy/stats/tests/test_discrete_basic.py", line 252, in check_discrete_chisquare
    freq,hsupp = np.histogram(rvs,histsupp,new=True)
TypeError: histogram() got an unexpected keyword argument 'new'

======================================================================
ERROR: test_discrete_basic.test_discrete_basic(<scipy.stats.distributions.hypergeom_gen object at 0x1042217d0>, (30, 12, 6), array([1, 1, 4, ..., 3, 2, 2]), 0.01, 'hypergeom chisquare')
----------------------------------------------------------------------
Traceback (most recent call last):
  File "/Library/Frameworks/Python.framework/Versions/2.6/lib/python2.6/site-packages/nose-0.11.2.dev-py2.6.egg/nose/case.py", line 186, in runTest
    self.test(*self.arg)
  File "/Library/Frameworks/Python.framework/Versions/2.6/lib/python2.6/site-packages/scipy/stats/tests/test_discrete_basic.py", line 252, in check_discrete_chisquare
    freq,hsupp = np.histogram(rvs,histsupp,new=True)
TypeError: histogram() got an unexpected keyword argument 'new'

======================================================================
ERROR: test_discrete_basic.test_discrete_basic(<scipy.stats.distributions.hypergeom_gen object at 0x1042217d0>, (21, 3, 12), array([2, 3, 2, ..., 2, 2, 1]), 0.01, 'hypergeom chisquare')
----------------------------------------------------------------------
Traceback (most recent call last):
  File "/Library/Frameworks/Python.framework/Versions/2.6/lib/python2.6/site-packages/nose-0.11.2.dev-py2.6.egg/nose/case.py", line 186, in runTest
    self.test(*self.arg)
  File "/Library/Frameworks/Python.framework/Versions/2.6/lib/python2.6/site-packages/scipy/stats/tests/test_discrete_basic.py", line 252, in check_discrete_chisquare
    freq,hsupp = np.histogram(rvs,histsupp,new=True)
TypeError: histogram() got an unexpected keyword argument 'new'

======================================================================
ERROR: test_discrete_basic.test_discrete_basic(<scipy.stats.distributions.hypergeom_gen object at 0x1042217d0>, (21, 18, 11), array([ 9,  8,  9, ..., 10, 10, 10]), 0.01, 'hypergeom chisquare')
----------------------------------------------------------------------
Traceback (most recent call last):
  File "/Library/Frameworks/Python.framework/Versions/2.6/lib/python2.6/site-packages/nose-0.11.2.dev-py2.6.egg/nose/case.py", line 186, in runTest
    self.test(*self.arg)
  File "/Library/Frameworks/Python.framework/Versions/2.6/lib/python2.6/site-packages/scipy/stats/tests/test_discrete_basic.py", line 252, in check_discrete_chisquare
    freq,hsupp = np.histogram(rvs,histsupp,new=True)
TypeError: histogram() got an unexpected keyword argument 'new'

======================================================================
ERROR: test_discrete_basic.test_discrete_basic(<scipy.stats.distributions.logser_gen object at 0x104221950>, (0.59999999999999998,), array([1, 1, 1, ..., 1, 1, 4]), 0.01, 'logser chisquare')
----------------------------------------------------------------------
Traceback (most recent call last):
  File "/Library/Frameworks/Python.framework/Versions/2.6/lib/python2.6/site-packages/nose-0.11.2.dev-py2.6.egg/nose/case.py", line 186, in runTest
    self.test(*self.arg)
  File "/Library/Frameworks/Python.framework/Versions/2.6/lib/python2.6/site-packages/scipy/stats/tests/test_discrete_basic.py", line 252, in check_discrete_chisquare
    freq,hsupp = np.histogram(rvs,histsupp,new=True)
TypeError: histogram() got an unexpected keyword argument 'new'

======================================================================
ERROR: test_discrete_basic.test_discrete_basic(<scipy.stats.distributions.nbinom_gen object at 0x1042214d0>, (5, 0.5), array([0, 2, 6, ..., 3, 3, 3]), 0.01, 'nbinom chisquare')
----------------------------------------------------------------------
Traceback (most recent call last):
  File "/Library/Frameworks/Python.framework/Versions/2.6/lib/python2.6/site-packages/nose-0.11.2.dev-py2.6.egg/nose/case.py", line 186, in runTest
    self.test(*self.arg)
  File "/Library/Frameworks/Python.framework/Versions/2.6/lib/python2.6/site-packages/scipy/stats/tests/test_discrete_basic.py", line 252, in check_discrete_chisquare
    freq,hsupp = np.histogram(rvs,histsupp,new=True)
TypeError: histogram() got an unexpected keyword argument 'new'

======================================================================
ERROR: test_discrete_basic.test_discrete_basic(<scipy.stats.distributions.nbinom_gen object at 0x1042214d0>, (0.40000000000000002, 0.40000000000000002), array([0, 0, 0, ..., 0, 0, 0]), 0.01, 'nbinom chisquare')
----------------------------------------------------------------------
Traceback (most recent call last):
  File "/Library/Frameworks/Python.framework/Versions/2.6/lib/python2.6/site-packages/nose-0.11.2.dev-py2.6.egg/nose/case.py", line 186, in runTest
    self.test(*self.arg)
  File "/Library/Frameworks/Python.framework/Versions/2.6/lib/python2.6/site-packages/scipy/stats/tests/test_discrete_basic.py", line 252, in check_discrete_chisquare
    freq,hsupp = np.histogram(rvs,histsupp,new=True)
TypeError: histogram() got an unexpected keyword argument 'new'

======================================================================
ERROR: test_discrete_basic.test_discrete_basic(<scipy.stats.distributions.planck_gen object at 0x104221c50>, (0.51000000000000001,), array([1, 1, 1, ..., 7, 0, 2]), 0.01, 'planck chisquare')
----------------------------------------------------------------------
Traceback (most recent call last):
  File "/Library/Frameworks/Python.framework/Versions/2.6/lib/python2.6/site-packages/nose-0.11.2.dev-py2.6.egg/nose/case.py", line 186, in runTest
    self.test(*self.arg)
  File "/Library/Frameworks/Python.framework/Versions/2.6/lib/python2.6/site-packages/scipy/stats/tests/test_discrete_basic.py", line 252, in check_discrete_chisquare
    freq,hsupp = np.histogram(rvs,histsupp,new=True)
TypeError: histogram() got an unexpected keyword argument 'new'

======================================================================
ERROR: test_discrete_basic.test_discrete_basic(<scipy.stats.distributions.poisson_gen object at 0x104221ad0>, (0.59999999999999998,), array([0, 0, 0, ..., 1, 0, 0]), 0.01, 'poisson chisquare')
----------------------------------------------------------------------
Traceback (most recent call last):
  File "/Library/Frameworks/Python.framework/Versions/2.6/lib/python2.6/site-packages/nose-0.11.2.dev-py2.6.egg/nose/case.py", line 186, in runTest
    self.test(*self.arg)
  File "/Library/Frameworks/Python.framework/Versions/2.6/lib/python2.6/site-packages/scipy/stats/tests/test_discrete_basic.py", line 252, in check_discrete_chisquare
    freq,hsupp = np.histogram(rvs,histsupp,new=True)
TypeError: histogram() got an unexpected keyword argument 'new'

======================================================================
ERROR: test_discrete_basic.test_discrete_basic(<scipy.stats.distributions.randint_gen object at 0x104221f50>, (7, 31), array([27, 10, 15, ..., 16,  9, 17]), 0.01, 'randint chisquare')
----------------------------------------------------------------------
Traceback (most recent call last):
  File "/Library/Frameworks/Python.framework/Versions/2.6/lib/python2.6/site-packages/nose-0.11.2.dev-py2.6.egg/nose/case.py", line 186, in runTest
    self.test(*self.arg)
  File "/Library/Frameworks/Python.framework/Versions/2.6/lib/python2.6/site-packages/scipy/stats/tests/test_discrete_basic.py", line 252, in check_discrete_chisquare
    freq,hsupp = np.histogram(rvs,histsupp,new=True)
TypeError: histogram() got an unexpected keyword argument 'new'

======================================================================
ERROR: test_discrete_basic.test_discrete_basic(<scipy.stats.distributions.skellam_gen object at 0x104227450>, (15, 8), array([ 4,  6, 10, ...,  5, 14, 15]), 0.01, 'skellam chisquare')
----------------------------------------------------------------------
Traceback (most recent call last):
  File "/Library/Frameworks/Python.framework/Versions/2.6/lib/python2.6/site-packages/nose-0.11.2.dev-py2.6.egg/nose/case.py", line 186, in runTest
    self.test(*self.arg)
  File "/Library/Frameworks/Python.framework/Versions/2.6/lib/python2.6/site-packages/scipy/stats/tests/test_discrete_basic.py", line 252, in check_discrete_chisquare
    freq,hsupp = np.histogram(rvs,histsupp,new=True)
TypeError: histogram() got an unexpected keyword argument 'new'

======================================================================
ERROR: test_discrete_basic.test_discrete_basic(<scipy.stats.distributions.zipf_gen object at 0x104227150>, (4,), array([1, 1, 1, ..., 1, 1, 1]), 0.01, 'zipf chisquare')
----------------------------------------------------------------------
Traceback (most recent call last):
  File "/Library/Frameworks/Python.framework/Versions/2.6/lib/python2.6/site-packages/nose-0.11.2.dev-py2.6.egg/nose/case.py", line 186, in runTest
    self.test(*self.arg)
  File "/Library/Frameworks/Python.framework/Versions/2.6/lib/python2.6/site-packages/scipy/stats/tests/test_discrete_basic.py", line 252, in check_discrete_chisquare
    freq,hsupp = np.histogram(rvs,histsupp,new=True)
TypeError: histogram() got an unexpected keyword argument 'new'

======================================================================
FAIL: test_mio.test_warnings(<type 'exceptions.FutureWarning'>, <function loadmat at 0x103ce6050>, '/Library/Frameworks/Python.framework/Versions/2.6/lib/python2.6/site-packages/scipy/io/matlab/tests/data/testdouble_7.1_GLNX86.mat')
----------------------------------------------------------------------
Traceback (most recent call last):
  File "/Library/Frameworks/Python.framework/Versions/2.6/lib/python2.6/site-packages/nose-0.11.2.dev-py2.6.egg/nose/case.py", line 186, in runTest
    self.test(*self.arg)
  File "/Library/Frameworks/Python.framework/Versions/2.6/lib/python2.6/site-packages/numpy/testing/utils.py", line 982, in assert_raises
    return nose.tools.assert_raises(*args,**kwargs)
AssertionError: FutureWarning not raised
    if hasattr(excClass,'__name__'): 'FutureWarning' = excClass.'unittest'
    else: 'FutureWarning' = str(excClass)
>>  raise self.failureException, "%s not raised" % 'FutureWarning'


======================================================================
FAIL: test_mio.test_mat4_3d(<type 'exceptions.DeprecationWarning'>, <function savemat at 0x103ce62a8>, <StringIO.StringIO instance at 0x104f57cb0>, {'a': array([[[ 0,  1,  2,  3],
----------------------------------------------------------------------
Traceback (most recent call last):
  File "/Library/Frameworks/Python.framework/Versions/2.6/lib/python2.6/site-packages/nose-0.11.2.dev-py2.6.egg/nose/case.py", line 186, in runTest
    self.test(*self.arg)
  File "/Library/Frameworks/Python.framework/Versions/2.6/lib/python2.6/site-packages/numpy/testing/utils.py", line 982, in assert_raises
    return nose.tools.assert_raises(*args,**kwargs)
AssertionError: DeprecationWarning not raised
    if hasattr(excClass,'__name__'): 'DeprecationWarning' = excClass.'unittest'
    else: 'DeprecationWarning' = str(excClass)
>>  raise self.failureException, "%s not raised" % 'DeprecationWarning'


======================================================================
FAIL: test_complex_symmetric_modes (test_arpack.TestEigenComplexSymmetric)
----------------------------------------------------------------------
Traceback (most recent call last):
  File "/Library/Frameworks/Python.framework/Versions/2.6/lib/python2.6/site-packages/scipy/sparse/linalg/eigen/arpack/tests/test_arpack.py", line 156, in test_complex_symmetric_modes
    self.eval_evec(self.symmetric[0],typ,k,which)
  File "/Library/Frameworks/Python.framework/Versions/2.6/lib/python2.6/site-packages/scipy/sparse/linalg/eigen/arpack/tests/test_arpack.py", line 145, in eval_evec
    assert_array_almost_equal(eval,exact_eval,decimal=_ndigits[typ])
  File "/Library/Frameworks/Python.framework/Versions/2.6/lib/python2.6/site-packages/numpy/testing/utils.py", line 774, in assert_array_almost_equal
    header='Arrays are not almost equal')
  File "/Library/Frameworks/Python.framework/Versions/2.6/lib/python2.6/site-packages/numpy/testing/utils.py", line 618, in assert_array_compare
    raise AssertionError(msg)
AssertionError: 
Arrays are not almost equal

(mismatch 100.0%)
 x: array([ 0.828 -4.967e-08j,  5.511 -1.366e-07j], dtype=complex64)
 y: array([ 5.+0.j,  6.+0.j], dtype=complex64)
>>  raise AssertionError('\nArrays are not almost equal\n\n(mismatch 100.0%)\n x: array([ 0.828 -4.967e-08j,  5.511 -1.366e-07j], dtype=complex64)\n y: array([ 5.+0.j,  6.+0.j], dtype=complex64)')


======================================================================
FAIL: test_symmetric_modes (test_arpack.TestEigenSymmetric)
----------------------------------------------------------------------
Traceback (most recent call last):
  File "/Library/Frameworks/Python.framework/Versions/2.6/lib/python2.6/site-packages/scipy/sparse/linalg/eigen/arpack/tests/test_arpack.py", line 109, in test_symmetric_modes
    self.eval_evec(self.symmetric[0],typ,k,which)
  File "/Library/Frameworks/Python.framework/Versions/2.6/lib/python2.6/site-packages/scipy/sparse/linalg/eigen/arpack/tests/test_arpack.py", line 98, in eval_evec
    assert_array_almost_equal(eval,exact_eval,decimal=_ndigits[typ])
  File "/Library/Frameworks/Python.framework/Versions/2.6/lib/python2.6/site-packages/numpy/testing/utils.py", line 774, in assert_array_almost_equal
    header='Arrays are not almost equal')
  File "/Library/Frameworks/Python.framework/Versions/2.6/lib/python2.6/site-packages/numpy/testing/utils.py", line 618, in assert_array_compare
    raise AssertionError(msg)
AssertionError: 
Arrays are not almost equal

(mismatch 50.0%)
 x: array([  1.638e-07,   0.000e+00], dtype=float32)
 y: array([ 0.,  1.], dtype=float32)
>>  raise AssertionError('\nArrays are not almost equal\n\n(mismatch 50.0%)\n x: array([  1.638e-07,   0.000e+00], dtype=float32)\n y: array([ 0.,  1.], dtype=float32)')


======================================================================
FAIL: test_iv_cephes_vs_amos_mass_test (test_basic.TestBessel)
----------------------------------------------------------------------
Traceback (most recent call last):
  File "/Library/Frameworks/Python.framework/Versions/2.6/lib/python2.6/site-packages/scipy/special/tests/test_basic.py", line 1617, in test_iv_cephes_vs_amos_mass_test
    assert dc[k] < 1e-9, (iv(v[k], x[k]), iv(v[k], x[k]+0j))
AssertionError: (1.8320048963545875e+306, (inf+0j))
    # Most error apparently comes from AMOS and not our implementation;
    # there are some problems near integer orders there
>>  assert array([  0.000e+00,   0.000e+00,   1.776e-15, ...,   0.000e+00,   0.000e+00,   0.000e+00])[358] < 1e-9, (iv(array([  1.942e+00,  -1.178e+01,  -2.288e-04, ...,  -2.894e+00,  -2.591e-01,  -1.522e+00])[358], array([ -2.203e+03,  -1.436e+00,   2.072e+00, ...,   1.203e+05,  -5.835e+01,  -9.028e+02])[358]), iv(array([  1.942e+00,  -1.178e+01,  -2.288e-04, ...,  -2.894e+00,  -2.591e-01,  -1.522e+00])[358], array([ -2.203e+03,  -1.436e+00,   2.072e+00, ...,   1.203e+05,  -5.835e+01,  -9.028e+02])[358]+0j))


======================================================================
FAIL: test_lambertw.test_values
----------------------------------------------------------------------
Traceback (most recent call last):
  File "/Library/Frameworks/Python.framework/Versions/2.6/lib/python2.6/site-packages/nose-0.11.2.dev-py2.6.egg/nose/case.py", line 186, in runTest
    self.test(*self.arg)
  File "/Library/Frameworks/Python.framework/Versions/2.6/lib/python2.6/site-packages/scipy/special/tests/test_lambertw.py", line 80, in test_values
    FuncData(w, data, (0,1), 2, rtol=1e-10, atol=1e-13).check()
  File "/Library/Frameworks/Python.framework/Versions/2.6/lib/python2.6/site-packages/scipy/special/tests/testutils.py", line 187, in check
    assert False, "\n".join(msg)
AssertionError: 
Max |adiff|: 2.5797
Max |rdiff|: 3.81511
Bad results for the following points (in output 0):
(-0.44800000000000001+0.40000000000000002j)                              0j => (-1.2370928928166736-1.6588828572971359j) != (-0.11855133765652383+0.66570534313583418j)  (rdiff             3.8151122286225245)
>>  assert False, "\n".join(['', 'Max |adiff|: 2.5797', 'Max |rdiff|: 3.81511', 'Bad results for the following points (in output 0):', '(-0.44800000000000001+0.40000000000000002j)                              0j => (-1.2370928928166736-1.6588828572971359j) != (-0.11855133765652383+0.66570534313583418j)  (rdiff             3.8151122286225245)'])


----------------------------------------------------------------------
Ran 4982 tests in 652.478s

FAILED (KNOWNFAIL=13, SKIP=27, errors=22, failures=6)
<nose.result.TextTestResult run=4982 errors=22 failures=6>